##TITLE= para-chloroaniline
##JCAMP-DX= 4.24   $$ ISAS JCAMP-DX check program V1.1/a
##DATA TYPE= INFRARED SPECTRUM
##ORIGIN= Chem. Dep't, UWI, JAMAICA
##OWNER= public domain
##DATE= 00/06/08
##TIME= 14:33:00
##SPECTROMETER/DATA SYSTEM= PERKIN-ELMER 1000 FT-IR
##INSTRUMENT PARAMETERS=
  X: 4000.00,400.00 cm-1; 16 scans; mode ratio; resol 2.00 cm-1; apod strong
##DATA PROCESSING=
##MOLFORM= C6H6ClN
##MW=127.57
##CASREGISTRYNO= 106-47-8
##MP= 67
##BP= 232
##STATE= solid
##RESOLUTION=   2.000000    
##DELTAX=  -2.000002    
##XUNITS= 1/CM
##YUNITS= TRANSMITTANCE
##XFACTOR=   .1220741    
##YFACTOR=   .2119791E-04
##FIRSTX=   4000.003    
##LASTX=   400.0000    
##MAXY=   .6945919
##MINY=   .3822455    
##NPOINTS=   1801
##FIRSTY=   .6509407 
##XYDATA=(X++(Y..Y))
32767 30708 30706 30702 30709 30722 30734 30733 30723 30730 30735 30727 30718 30709 30697 30716 30735 30712 30694 30704 30692 30693 30700 30685 30682 30679 30670 30683 30676 30671 30679 30674 30686 30698 30699 30693 30683 30670 30678 30695 30669 30672 30687 30692 30706 30699
32046 30699 30651 30614 30611 30634 30635 30655 30662 30622 30599 30626 30634 30598 30608 30622 30592 30599 30588 30551 30507 30482 30626 30645 30595 30618 30616 30590 30568 30532 30485 30605 30638 30622 30601
31505 30601 30603 30599 30596 30637 30678 30685 30673 30658 30646 30639 30602 30635 30689 30665 30682 30647 30614 30608 30598 30617 30606 30654 30638 30618 30671 30689 30688 30673 30653 30629 30615 30602 30615 30633 30636 30632
30916 30632 30627 30641 30616 30624 30647 30624 30628 30635 30614 30599 30560 30551 30573 30541 30581 30570 30572 30562 30587 30656 30668 30634 30610 30611 30618 30654 30671 30650 30613 30594 30617 30643 30645 30634 30623 30657
30326 30657 30656 30629 30620 30603 30619 30678 30685 30686 30664 30619 30572 30544 30633 30641 30573 30637 30674 30650 30627 30634 30627 30577 30586 30576 30541 30567 30598 30625 30605 30589 30591 30582 30555 30517 30481 30502
29736 30502 30585 30573 30546 30523 30530 30545 30546 30541 30527 30507 30518 30546 30559 30528 30488 30474 30496 30523 30521 30467 30457 30540 30544 30521 30510 30498 30495 30491 30461 30403 30380 30418 30443 30454 30451
29163 30451 30449 30446 30428 30420 30412 30409 30413 30418 30430 30441 30438 30439 30412 30411 30411 30405 30424 30450 30454 30462 30471 30484 30490 30493 30504 30511 30534 30569 30586 30597 30628 30643 30630 30599 30552 30449 30266 29923 29315
28524 29315 28423 27376 26462 26095 26309 26788 27293 27724 28039 28302 28514 28679 28822 28950 29047 29122 29229 29315 29354 29404 29457 29511 29560
28147 29560 29587 29629 29680 29704 29703 29736 29806 29878 29909 29933 29984 30038 30068 30093 30133 30188 30246 30284 30291 30268 30149 29781 28921 27318 25328 24141 24329
27704 24329 25221 26122 26827 27346 27736 28034 28254 28425 28574 28717 28830 28906 28973 29027 29096 29167 29203 29237 29278 29310 29340 29374 29404 29425 29446 29464
27279 29464 29491 29524 29540 29549 29562 29566 29575 29592 29618 29647 29662 29660 29663 29679 29702 29717 29726 29742 29762 29761 29758 29768 29777 29786 29799 29809 29833 29848 29849 29859 29853 29857 29891 29904 29886 29891 29904 29913 29915
26640 29915 29928 29949 29950 29951 29960 29974 29988 29984 29984 30006 30013 30010 30010 30000 30006 30024 30025 30032 30030 30028 30012 30008 30007 29995 29955 29881 29831 29835 29857 29880 29898 29908 29928 29950 29956 29973 29984 30000 30027 30034 30040
25968 30040 30058 30070 30081 30087 30084 30082 30090 30108 30106 30096 30102 30105 30093 30105 30114 30127 30127 30110 30106 30108 30115 30130 30148 30153 30132 30117 30130 30145 30146 30154 30170 30170 30167 30163 30156 30150 30141 30144 30174 30191 30190 30195 30205
25263 30205 30210 30226 30247 30236 30224 30230 30234 30243 30246 30245 30219 30169 30138 30139 30170 30194 30204 30217 30236 30245 30235 30202 30170 30173 30183 30179 30176 30186 30222 30236 30243 30263 30277 30283 30285 30286 30286 30284 30289 30295 30298
24592 30298 30292 30274 30275 30272 30268 30268 30263 30255 30253 30247 30222 30205 30208 30218 30231 30212 30183 30167 30168 30186 30192 30189 30191 30195 30200 30197 30196 30213 30203 30161 30126 30094 30068 30039 30011 29984 29950 29931 29925 29929 29960
23920 29960 30008 30037 30076 30122 30151 30157 30163 30171 30154 30151 30167 30175 30170 30145 30135 30176 30228 30251 30259 30264 30266 30267 30268 30264 30253 30257 30250 30222 30198 30163 30129 30110 30095 30105 30142 30187 30237 30279
23297 30279 30308 30344 30369 30369 30380 30396 30404 30414 30417 30426 30438 30435 30436 30437 30441 30458 30456 30441 30429 30422 30435 30456 30466 30474 30480 30487 30485 30477 30476 30471 30477 30491 30493 30479 30470 30477 30474 30478 30484 30498 30518 30525 30515 30507
22576 30507 30513 30515 30521 30525 30507 30502 30503 30506 30521 30522 30502 30502 30514 30510 30520 30520 30523 30536 30554 30556 30547 30564 30569 30559 30566 30569 30577 30572 30563 30568 30580 30587 30580 30574 30587 30605 30613 30619 30622 30608 30595 30588 30565 30544 30537 30542
21823 30542 30541 30542 30543 30545 30557 30576 30575 30567 30545 30522 30517 30524 30525 30540 30553 30558 30572 30567 30556 30565 30584 30594 30596 30602 30607 30597 30592 30579 30541 30518 30521 30524 30536 30568 30599 30619 30634 30652 30649 30634 30625
21151 30625 30610 30587 30560 30542 30531 30532 30546 30543 30540 30556 30583 30597 30603 30625 30639 30640 30637 30646 30656 30666 30671 30666 30672 30683 30701 30715 30722 30725 30718 30710 30711 30717 30728 30729 30721 30733 30737 30735 30744 30753 30746 30738 30744 30752 30754
20414 30754 30757 30763 30766 30761 30757 30766 30781 30775 30769 30775 30782 30782 30775 30765 30770 30785 30796 30802 30787 30770 30766 30763 30757 30742 30742 30760 30763 30760 30753 30745 30744 30751 30762 30777 30778 30762 30763 30778 30782 30784 30786 30774 30766 30777 30789 30790 30808
19644 30808 30813 30805 30811 30827 30833 30830 30807 30792 30774 30746 30713 30699 30688 30671 30662 30647 30629 30611 30604 30636 30653 30697 30744 30745 30724 30706 30696 30655 30630 30649 30658 30652 30680 30696 30695 30715 30737
19038 30737 30758 30769 30777 30776 30765 30751 30744 30768 30789 30811 30853 30871 30868 30876 30902 30907 30889 30890 30905 30910 30918 30931 30942 30950 30959 30970 30971 30964 30975 30990 30985 30973 30968 30960 30958 30970 30973 30965 30971 30982 30986 30984
18350 30984 30992 31001 31002 31004 31003 30999 30995 30996 31008 31015 31019 31031 31037 31039 31049 31059 31058 31048 31051 31056 31056 31055 31052 31049 31052 31052 31046 31039 31026 31026 31040 31048 31051 31062 31075 31072 31072 31079 31085 31083 31081 31082 31087 31100 31113 31121 31121 31119 31122 31119 31119 31132
17498 31132 31138 31138 31136 31128 31123 31122 31119 31127 31140 31148 31143 31139 31128 31115 31104 31088 31084 31083 31085 31092 31098 31096 31107 31140 31156 31161 31174 31181 31180 31183 31194 31203 31205 31212 31218 31217 31207 31203 31210 31218 31221 31217 31227 31236 31236 31231 31232 31245 31249
16695 31249 31251 31263 31267 31266 31267 31266 31271 31267 31258 31249 31246 31238 31233 31226 31225 31236 31244 31255 31271 31277 31281 31292 31303 31295 31285 31302 31323 31327 31324 31324 31325 31330 31344 31358 31371 31393 31399 31397 31395 31388 31382 31397 31397 31392 31399 31415 31424 31434
15908 31434 31426 31418 31426 31429 31427 31435 31448 31436 31413 31399 31401 31432 31447 31450 31456 31468 31486 31497 31502 31497 31505 31513 31511 31503 31472 31410 31304 31120 30885 30733 30768 30931 31080 31182 31252
15335 31252 31325 31393 31414 31423 31431 31460 31495 31508 31507 31503 31494 31499 31498 31524 31550 31554 31572 31578 31564 31554 31562 31563 31544 31545 31544 31547 31564 31574 31578 31594 31619 31641 31655 31658 31666 31671 31658 31661 31669 31689 31696 31691 31708
14630 31708 31729 31729 31742 31729 31706 31678 31668 31671 31654 31613 31581 31587 31578 31586 31637 31629 31620 31667 31704 31696 31680 31701 31716 31714 31674 31728 31748 31773 31812 31814 31831 31829 31796 31835 31876 31873 31895
14024 31895 31905 31891 31900 31897 31874 31897 31885 31915 31907 31864 31832 31814 31801 31913 31907 31899 31914 31921 31898 31854 31877 31878 31840 31833 31853 31828 31779 31732 31729 31587 31485 31383 31170 31013
13467 31013 30891 30758 30653 30340 29911 29526 29066 28180 27095 25237 22627 21026 19955 20111 21114 22443 23941 25297
13172 25297 26300 27065 27672 28121 28528 28914 29211 29397 29538 29664 29772 29862 29973 30059 30089 30225 30424 30555 30732 30860 30902 30940
12812 30940 30928 30916 30930 30853 30917 30999 31100 31185 31222 31319 31427 31596 31645 31642 31654 31607 31516 31472 31486 31565 31642 31732 31701 31687 31528 31232 30870 29892 26097
12337 26097 23529 20624 18957 19620 18763 18032 18990 21904 23990 25077 26099 27044 27755 28167 28534 28736 28839 28935 29097
12025 29097 29327 29550 29643 29729 29882 30087 30128 30160 30164 30125 30042 29917 29801 29794 29933 30217 30357 30457 30576 30653 30698 30749 30783 30835 30915 30943 30981
11583 30981 31020 31049 31061 31085 31110 31101 31093 31110 31144 31199 31215 31215 31194 31154 31172 31259 31331 31364 31388 31415 31436 31454 31461 31446 31441 31477 31490 31493 31505 31525 31558 31605 31634 31653
11026 31653 31659 31646 31645 31657 31641 31625 31622 31614 31604 31625 31672 31728 31807 31869 31883 31892 31921 31956 31997 31997 31944 31795 31448 30650 28939 26347 24058 23037 23388
10551 23388 24616 25793 26603 27230 27778 28236 28640 29008 29364 29682 29910 30091 30271 30437 30590 30719 30826 30926 31012 31080 31138
10207 31138 31186 31219 31229 31253 31281 31322 31365 31393 31436 31485 31518 31548 31576 31594 31619 31639 31647 31657 31686 31713 31742 31780 31838 31881 31929 31969 32020 32010 31448 29439
9715 29439 27564 27251 28102 29697 30604 30933 31151 31304 31406 31477 31520 31543 31577 31597 31610 31625 31640 31637 31650 31705 31766 31800 31836 31846 31842 31803 31688
9273 31688 31492 31272 31135 31069 31008 30885 30759 30780 30968 31226 31452 31611 31715 31796 31867 31922 31834 30767 28638 27234 25959 26486
8913 26486 28848 30284 30827 31064 31224 31337 31418 31431 31450 31520 31592 31629 31670 31692 31669 31581 31453 31388 31440 31545 31622 31675 31701 31717 31726 31752 31758 31774
8454 31774 31776 31767 31755 31772 31779 31787 31791 31815 31824 31763 31550 31022 30523 30698 31268 31643 31821 31929 31998 32041 32067 32079 32098 32107 32111 32122 32150 32182 32215 32229 32239 32240
7930 32240 32257 32278 32282 32285 32308 32316 32312 32313 32324 32335 32343 32354 32361 32369 32339 32293 32319 32340 32236 32139 32212 32350 32393 32408 32443 32477 32474 32474 32465 32442 32406 32419 32435 32430 32437 32434 32418 32403
7307 32403 32385 32401 32444 32483 32491 32458 32454 32470 32459 32438 32427 32390 32362 32347 32329 32292 32275 32254 32200 32137 32072 31958 31785 31502 31018 30199 28779 26543
6848 26543 24035 22597 22877 24020 24600 23975 22995 23182 24796 26834 28402 29410 30060 30512 30864 31127 31295 31411 31497
6537 31497 31581 31658 31736 31801 31867 31903 31934 31984 31965 31931 31935 31961 31992 32031 32040 32067 32085 32093 32124 32137 32125 32122 32095 32075 32024 31982 32021 32057 32043 32027 32042 32089 32098 32066
5980 32066 32007 31999 32023 32036 32046 32026 32000 31991 32032 32064 32050 32046 32020 31861 31613 31566 31754 31922 32037 32068 32081 32122 32182 32214 32208 32195 32176 32209 32232 32224 32318 32389
5456 32389 32365 32420 32522 32629 32680 32738 32767 32707 32323 30999 28706 27083 26914 27550 28457 29312 29939 30318 30505 30659 30821 30979
5095 30979 31123 31229 31341 31449 31499 31511 31562 31563 31528 31586 31646 31600 31582 31605 31651 31663 31676 31722 31752 31769 31778 31728 31675 31737 31755 31687 31642 31678 31691 31729 31791
4587 31791 31847 31916 31910 31831 31790 31840 31922 31903 31869 31831 31848 31874 31930 31970 31946 31974 32028 32071 32141 32157 32068 31762 31115 29439 26505 24443 25022 26809
4129 26809 28379 29365 29875 30161 30449 30732 30859 30889 31040 31227 31289 31324 31330 31370 31447 31469 31441 31476 31625 31747 31832 31853 31824 31733 31648 31562
3703 31562 31694 31926 32086 32000 31852 31903 31885 31956 32011 31985 32051 32153 32136 31935 31894 31387 30863 31534 31503 30876 30723 31056 31234 31038 30679
3293 30679 30063
3277 30063
##END=
